Target
Sigma non-opioid intracellular receptor 1
Ligand
BDBM50013955
Substrate
Meas. Tech.
ChEMBL_201275 (CHEMBL804964)
Ki
1372±n/a nM
Citation
 de Costa, BRRice, KCBowen, WDThurkauf, ARothman, RBBand, LJacobson, AERadesca, LContreras, PCGray, NM Synthesis and evaluation of N-substituted cis-N-methyl-2-(1-pyrrolidinyl)cyclohexylamines as high affinity sigma receptor ligands. Identification of a new class of highly potent and selective sigma receptor probes. J Med Chem 33:3100-10 (1990)  
Target
Name:
Sigma non-opioid intracellular receptor 1
Synonyms:
Aging-associated gene 8 protein SGMR1_HUMAN SIGMAR1 SR31747-binding protein Sigma 1-type opioid receptor Sigma1R | hSigmaR1
Type:
Enzyme Catalytic Domain
Mol. Mass.:
25124.85
Organism:
Homo sapiens (Human)
Description:
Q99720
Residue:
223
  
Inhibitor
Name:
BDBM50013955
Synonyms:
N-Methyl-2-naphthalen-2-yl-N-(2-pyrrolidin-1-yl-cyclohexyl)-acetamide | N-methyl-2-(naphthalen-2-yl)-N-[(2S)-2-(pyrrolidin-1-yl)cyclohexyl]acetamide
Type:
Small organic molecule
Emp. Form.:
C23H30N2O
Mol. Mass.:
350.4971
SMILES:
CN(C1CCCC[C@@H]1N1CCCC1)C(=O)Cc1ccc2ccccc2c1
: