Target
Melanocortin receptor 5
Ligand
BDBM50058158
Substrate
Meas. Tech.
ChEMBL_106517 (CHEMBL713021)
EC50
269±n/a nM
Citation
 Haskell-Luevano, CNikiforovich, GSharma, SDYang, YKDickinson, CHruby, VJGantz, I Biological and conformational examination of stereochemical modifications using the template melanotropin peptide, Ac-Nle-c[Asp-His-Phe-Arg-Trp-Ala-Lys]-NH2, on human melanocortin receptors. J Med Chem 40:1738-48 (1997)  
Target
Name:
Melanocortin receptor 5
Synonyms:
MC-2 MC5R Melanocortin MC5 Melanocortin receptor 5 | Melanocortin receptor 5 (MC5R)
Type:
Enzyme
Mol. Mass.:
36612.92
Organism:
Homo sapiens (Human)
Description:
P33032
Residue:
325
  
Inhibitor
Name:
BDBM50058158
Synonyms:
(3S,6S,9S,12S,15S,18S,26S)-18-((S)-2-Acetylamino-hexanoylamino)-12-benzyl-9-(3-guanidino-propyl)-15-(3H-imidazol-4-ylmethyl)-6-(1H-indol-3-ylmethyl)-3-methyl-2,5,8,11,14,17,20-heptaoxo-1,4,7,10,13,16,21heptaaza-cyclohexacosane-26-carboxylic acid amide | CHEMBL217584
Type:
Small organic molecule
Emp. Form.:
C53H74N16O10
Mol. Mass.:
1095.2559
SMILES:
CCCC[C@H](NC(C)=O)C(=O)N[C@H]1CC(=O)NCCCC[C@H](NC(=O)[C@H](C)NC(=O)[C@H](Cc2c[nH]c3ccccc23)NC(=O)[C@H](CCCNC(N)=N)NC(=O)[C@H](Cc2ccccc2)NC(=O)[C@H](Cc2cnc[nH]2)NC1=O)C(N)=O
: