Target
Acidic mammalian chitinase
Ligand
BDBM72759
Substrate
Meas. Tech.
ChEMBL_649681 (CHEMBL1219379)
IC50
700±n/a nM
Citation
 Cole, DCOlland, AMJacob, JBrooks, JBursavich, MGCzerwinski, RDeClercq, CJohnson, MJoseph-McCarthy, DEllingboe, JWLin, LNowak, PPresman, EStrand, JTam, AWilliams, CMYao, STsao, DHFitz, LJ Identification and characterization of acidic mammalian chitinase inhibitors. J Med Chem 53:6122-8 (2010)  
Target
Name:
Acidic mammalian chitinase
Synonyms:
AMCase CHIA Lung-specific protein TSA1902
Type:
Protein
Mol. Mass.:
52266.66
Organism:
Homo sapiens (Human)
Description:
Q9BZP6
Residue:
476
  
Inhibitor
Name:
BDBM72759
Synonyms:
2-methyl-3-[(4-pyridin-2-ylpiperazin-1-yl)methyl]-1H-indole 2-methyl-3-[[4-(2-pyridyl)piperazino]methyl]-1H-indole MLS000860449 cid_2813100
Type:
Small organic molecule
Emp. Form.:
C19H22N4
Mol. Mass.:
306.4048
SMILES:
Cc1[nH]c2ccccc2c1CN1CCN(CC1)c1ccccn1
: