Target
Aurora kinase B
Ligand
BDBM50379497
Substrate
Meas. Tech.
ChEMBL_812217 (CHEMBL2013812)
IC50
3±n/a nM
Citation
 Le Brazidec, JYPasis, ATam, BBoykin, CBlack, CWang, DClaassen, GChong, JHChao, JFan, JNguyen, KSilvian, LLing, LZhang, LChoi, MTeng, MPathan, NZhao, SLi, TTaveras, A Synthesis, SAR and biological evaluation of 1,6-disubstituted-1H-pyrazolo[3,4-d]pyrimidines as dual inhibitors of Aurora kinases and CDK1. Bioorg Med Chem Lett 22:2070-4 (2012)  
Target
Name:
Aurora kinase B
Synonyms:
AIK2 AIM1 ARK2 AURKB_HUMAN Aurora B-INCENP Aurora kinase B (AURKB) STK-1 STK12 Serine/threonine-protein kinase aurora B
Type:
Protein
Mol. Mass.:
39327.72
Organism:
Homo sapiens (Human)
Description:
Q96GD4
Residue:
344
  
Inhibitor
Name:
BDBM50379497
Synonyms:
CHEMBL2012409
Type:
Small organic molecule
Emp. Form.:
C22H27N7O2
Mol. Mass.:
421.4955
SMILES:
Cn1cc(Nc2ncc3cnn([C@H]4C[C@@H]5C[C@@H]5C4)c3n2)cc1C(=O)N1CCC[C@H]1CO
: