Target
5-hydroxytryptamine receptor 3A/3B
Ligand
BDBM48320
Substrate
Meas. Tech.
ChEMBL_3112 (CHEMBL620590)
Kd
224±n/a nM
Citation
 Hibert, MFHoffmann, RMiller, RCCarr, AA Conformation-activity relationship study of 5-HT3 receptor antagonists and a definition of a model for this receptor site. J Med Chem 33:1594-600 (1990)  
Target
Name:
5-hydroxytryptamine receptor 3A/3B
Synonyms:
Serotonin 3 receptor (5HT3)
Type:
Mol. Mass.:
Description:
ASSAY_ID of ChEMBL is 357762
Components:
This complex has 2 components.
Component 1
Name:
5-hydroxytryptamine receptor 3A
Synonyms:
5-HT-3 5-HT3A 5-HT3R 5-hydroxytryptamine receptor 3A 5ht3 Htr3a Serotonin 3a (5-HT3a) receptor Serotonin-gated ion channel receptor
Type:
Mol. Mass.:
56056.00
Organism:
Mus musculus (house mouse)
Description:
5HT3A
Residue:
487
  
Component 2
Name:
5-hydroxytryptamine receptor 3B
Synonyms:
5HT3B_MOUSE Serotonin 3 receptor (5HT3) | Serotonin 3b (5-HT3b) receptor
Type:
PROTEIN
Mol. Mass.:
50317.35
Organism:
Mus musculus
Description:
ChEMBL_3121
Residue:
437
  
Inhibitor
Name:
BDBM48320
Synonyms:
4-amino-5-chloro-N-[2-(diethylamino)ethyl]-2-methoxy-benzamide;hydrochloride 4-azanyl-5-chloranyl-N-[2-(diethylamino)ethyl]-2-methoxy-benzamide;hydrochloride METOCLOPRAMIDE HYDROCHLORIDE Metochloropramide US11147820, Compound Metoclopramide US9132134, Metoclopramide | cid_23659
Type:
Small organic molecule
Emp. Form.:
C14H22ClN3O2
Mol. Mass.:
299.796
SMILES:
CCN(CC)CCNC(=O)c1cc(Cl)c(N)cc1OC
: