BDBM23776 (2R)-2-amino-3-[(1,1-diphenylpentyl)sulfanyl]propanoic acid::S-Trityl-L-Cysteine (STLC) Analogue, 5
SMILES CCCCC(SC[C@H](N)C(O)=O)(c1ccccc1)c1ccccc1
InChI Key InChIKey=OVYHEQOJVOYIGX-SFHVURJKSA-N
Data  1 KI  1 IC50
  Tab Delimited (TSV)   2D SDfile   Computed 3D by Vconf -m prep SDfile
Find this compound or compounds like it in BindingDB:
Activity Spreadsheet -- Enzyme Inhibition Constant Data from BindingDB
Found 2 hits for monomerid = 23776
TargetKinesin-like protein KIF11(Homo sapiens (Human))
Institut De Biologie Structurale
LigandPNGBDBM23776((2R)-2-amino-3-[(1,1-diphenylpentyl)sulfanyl]propa...)
Affinity DataKi:  175nM ΔG°:  -9.12kcal/molepH: 6.9 T: 2°C. Assay description: The microtubule-activated ATPase rates were measured using the pyruvate kinase/lactate dehydrogenase-linked assay. To optimize the signal for basal E...
In DepthDetails ArticlePubMed
TargetKinesin-like protein KIF11(Homo sapiens (Human))
Institut De Biologie Structurale
LigandPNGBDBM23776((2R)-2-amino-3-[(1,1-diphenylpentyl)sulfanyl]propa...)
Affinity DataIC50:  319nM. Assay description: Inhibition of C-terminal His6-tagged human Eg5 microtubule-stimulated ATPase activity
In DepthDetails ArticlePubMed