BDBM92455 CHEMBL265470::STO-609
SMILES OC(=O)c1ccc2c3nc4ccccc4n3c(=O)c3cccc1c23
InChI Key InChIKey=MYKOWOGZBMOVBJ-UHFFFAOYSA-N
Data  13 IC50
PDB links: 1 PDB ID matches this monomer.
  Tab Delimited (TSV)   2D SDfile   Computed 3D by Vconf -m prep SDfile
Find this compound or compounds like it in BindingDB:
Activity Spreadsheet -- Enzyme Inhibition Constant Data from BindingDB
Found 13 hits for monomerid = 92455
TargetCalcium/calmodulin-dependent protein kinase kinase 2(Homo sapiens (Human))
Riken Systems And Structural Biology Center
LigandPNGBDBM92455(CHEMBL265470 | STO-609)
Affinity DataIC50:  500nMpH: 7.5 T: 2°C. Assay description: The AMPK peptide including the sequence surrounding the phosphorylation site of AMPK (167GEFLRTSCGSP177), was synthesized at the Support Unit for Bio...
TargetCalcium/calmodulin-dependent protein kinase kinase 2 [ P274E](Homo sapiens (Human))
Riken Systems And Structural Biology Center
LigandPNGBDBM92455(CHEMBL265470 | STO-609)
Affinity DataIC50:  2.42E+4nMpH: 7.5 T: 2°C. Assay description: The AMPK peptide including the sequence surrounding the phosphorylation site of AMPK (167GEFLRTSCGSP177), was synthesized at the Support Unit for Bio...
TargetMyosin light chain kinase, smooth muscle(Homo sapiens (Human))
University Of Oxford
Curated by ChEMBL
LigandPNGBDBM92455(CHEMBL265470 | STO-609)
Affinity DataIC50:  3.18E+4nM. Assay description: Binding affinity at MLCKChecked by Author
In DepthDetails ArticlePubMed
TargetCalcium/calmodulin-dependent protein kinase kinase 1(Homo sapiens (Human))
University Of Oxford
Curated by ChEMBL
LigandPNGBDBM92455(CHEMBL265470 | STO-609)
Affinity DataIC50:  381nM. Assay description: Inhibition of CaM-KKalphaChecked by Author
In DepthDetails ArticlePubMed
TargetCalcium/calmodulin-dependent protein kinase kinase 2(Homo sapiens (Human))
Riken Systems And Structural Biology Center
LigandPNGBDBM92455(CHEMBL265470 | STO-609)
Affinity DataIC50:  127nM. Assay description: Inhibition of CaM-KKbetaChecked by Author
TargetMitogen-activated protein kinase 1(Homo sapiens (Human))
University Of Oxford
Curated by ChEMBL
LigandPNGBDBM92455(CHEMBL265470 | STO-609)
Affinity DataIC50: >3.18E+4nM. Assay description: Inhibition of ERK2Checked by Author
In DepthDetails ArticlePubMed
TargetSerine/threonine-protein kinase pim-3(Homo sapiens (Human))
University Of Dundee
Curated by ChEMBL
LigandPNGBDBM92455(CHEMBL265470 | STO-609)
Affinity DataIC50:  83nM. Assay description: Inhibition of PIM3 in the presence of 100uM ATP
In DepthDetails ArticlePubMed
TargetCalcium/calmodulin-dependent protein kinase kinase 2(Homo sapiens (Human))
Riken Systems And Structural Biology Center
LigandPNGBDBM92455(CHEMBL265470 | STO-609)
Affinity DataIC50:  10nM. Assay description: Inhibition of CAMKKbeta in the presence of 20uM ATP
TargetSerine/threonine-protein kinase pim-2(Homo sapiens (Human))
University Of Dundee
Curated by ChEMBL
LigandPNGBDBM92455(CHEMBL265470 | STO-609)
Affinity DataIC50:  110nM. Assay description: Inhibition of PIM2 in the presence of 5uM ATP
In DepthDetails ArticlePubMed
TargetMAP kinase-interacting serine/threonine-protein kinase 1(Homo sapiens (Human))
University Of Dundee
Curated by ChEMBL
LigandPNGBDBM92455(CHEMBL265470 | STO-609)
Affinity DataIC50:  120nM. Assay description: Inhibition of MNK1 in the presence of 50uM ATP
In DepthDetails ArticlePubMed
TargetDual specificity tyrosine-phosphorylation-regulated kinase 2(Homo sapiens (Human))
University Of Dundee
Curated by ChEMBL
LigandPNGBDBM92455(CHEMBL265470 | STO-609)
Affinity DataIC50:  950nM. Assay description: Inhibition of DYRK2 in the presence of 50uM ATP
In DepthDetails ArticlePubMed
TargetCalcium/calmodulin-dependent protein kinase kinase 1(Homo sapiens (Human))
University Of Oxford
Curated by ChEMBL
LigandPNGBDBM92455(CHEMBL265470 | STO-609)
Affinity DataIC50:  120nM. Assay description: Inhibition of CAMKKalpha in the presence of 20uM ATP
In DepthDetails ArticlePubMed
TargetCalcium/calmodulin-dependent protein kinase type IV(Homo sapiens (Human))
University Of Oxford
Curated by ChEMBL
LigandPNGBDBM92455(CHEMBL265470 | STO-609)
Affinity DataIC50: >3.18E+4nM. Assay description: Inhibition of CaM-K4Checked by Author
In DepthDetails ArticlePubMed