BDBM50479547 CHEMBL455138
SMILES [#6]-[#8]-c1ccc(cc1)-[#6](=O)\[#6]=[#6]-1\c2ccccc2-[#6](=O)-c2ccccc-12
InChI Key InChIKey=LMXCFZCMNBWAHM-UHFFFAOYSA-N
Data  3 IC50
  Tab Delimited (TSV)   2D SDfile   Computed 3D by Vconf -m prep SDfile
Find this compound or compounds like it in BindingDB:
Activity Spreadsheet -- Enzyme Inhibition Constant Data from BindingDB
Found 3 hits for monomerid = 50479547
TargetTubulin beta chain(Sus scrofa)
Westphalian Wilhelms-University
Curated by ChEMBL
LigandPNGBDBM50479547(CHEMBL455138)
Affinity DataIC50:  400nM. Assay description: Displacement of [3H]Colchicine from pig biotinylated tubulin after 2 hrs by SPA
Ligand InfoPC cidPC sid
In DepthDetails ArticlePubMed
TargetTubulin beta chain(Sus scrofa)
Westphalian Wilhelms-University
Curated by ChEMBL
LigandPNGBDBM50479547(CHEMBL455138)
Affinity DataIC50: >1.00E+5nM. Assay description: Displacement of [3H]paclitaxel from pig biotinylated tubulin after 2 hrs by SPA
Ligand InfoPC cidPC sid
In DepthDetails ArticlePubMed
TargetTubulin beta chain(Sus scrofa)
Westphalian Wilhelms-University
Curated by ChEMBL
LigandPNGBDBM50479547(CHEMBL455138)
Affinity DataIC50:  520nM. Assay description: Inhibition of pig brain tubulin polymerization after 30 mins by turbidimetric assay
Ligand InfoPC cidPC sid
In DepthDetails ArticlePubMed