BDBM545473 US11286268, Compound 964
SMILES Cc1cc(-c2cc(Cl)ccc2OCCn2c(C)nc3cc(c(-c4nc(C)ncc4F)c(C#N)c3c2=O)C(F)(F)F)c2scc(C(O)=O)c2n1
InChI Key InChIKey=BVRXNRZQTFFMDM-UHFFFAOYSA-N
Data  1 IC50
  Tab Delimited (TSV)   2D SDfile   Computed 3D by Vconf -m prep SDfile
Find this compound or compounds like it in BindingDB:
Activity Spreadsheet -- Enzyme Inhibition Constant Data from BindingDB
Found 1 hit for monomerid = 545473
TargetEukaryotic translation initiation factor 4E-binding protein 1(Homo sapiens (Human))
Effector Therapeutics
US Patent
LigandPNGBDBM545473(US11286268, Compound 964)
Affinity DataIC50:  3.32nM. Assay description: eIF4E protein was pre-incubated with EDA-m7GDP-ATTO-550 in FPB at 2xconcentrations for 5 minutes prior to the addition of compounds. Compounds (100x)...
Ligand InfoPC cidPC sid
In DepthDetails US Patent