Target
Gag-Pol polyprotein [588-1027,K691N]/[588-1147,K690N]
Ligand
BDBM27578
Substrate
poly r(A).oligo d(T)16
Meas. Tech.
Reverse Transcriptase Assay
pH
7.8±n/a
Temperature
310.15±n/a K
IC50
1268±565 nM
Citation
 Jones, LHAllan, GBarba, OBurt, CCorbau, RDupont, TKnöchel, TIrving, SMiddleton, DSMowbray, CEPerros, MRingrose, HSwain, NAWebster, RWestby, MPhillips, C Novel Indazole Non-Nucleoside Reverse Transcriptase Inhibitors Using Molecular Hybridization Based on Crystallographic Overlays (dagger). J Med Chem 52:1219-23 (2009)  
Target
Name:
Gag-Pol polyprotein [588-1027,K691N]/[588-1147,K690N]
Synonyms:
HIV-1 Reverse Transcriptase Mutant (K103N)
Type:
Protein Complex
Mol. Mass.:
Description:
Components:
This complex has 2 components.
Component 1
Name:
Gag-Pol polyprotein [588-1147,K690N]
Synonyms:
HIV-1 Reverse Transcriptase Mutant (K103N) Chain A gag-pol
Type:
Enzyme Subunit
Mol. Mass.:
64471.33
Organism:
Human immunodeficiency virus type 1
Description:
P04585[588-1147,K690N]
Residue:
560
  
Component 2
Name:
Gag-Pol polyprotein [588-1027,K691N]
Synonyms:
HIV-1 Reverse Transcriptase Mutant (K103N) Chain B gag-pol
Type:
Enzyme Subunit
Mol. Mass.:
51322.05
Organism:
Human immunodeficiency virus type 1
Description:
P04585[588-1027,K691N]
Residue:
440
  
Inhibitor
Name:
BDBM27578
Synonyms:
5-{[7-(hydroxymethyl)-3-methyl-1H-indazol-4-yl]oxy}benzene-1,3-dicarbonitrile | Indazole Derivative, 8
Type:
Small organic molecule
Emp. Form.:
C17H12N4O2
Mol. Mass.:
304.3028
SMILES:
Cc1n[nH]c2c(CO)ccc(Oc3cc(cc(c3)C#N)C#N)c12
:
Substrate
Name:
poly r(A).oligo d(T)16
Synonyms:
Type:
RNA/DNA duplex
Mol. Mass.:
358.43
Organism:
Description:
Tritium-labeled TTP is co-substrate.
Residue:
3
NA