Target
Gag-Pol polyprotein [588-1027,K691N]/[588-1147,K690N]
Ligand
BDBM2483
Substrate
poly r(A).oligo d(T)16
Meas. Tech.
Reverse Transcriptase Assay
pH
7.8±n/a
Temperature
310.15±n/a K
IC50
364±212 nM
Citation
 Jones, LHAllan, GBarba, OBurt, CCorbau, RDupont, TKnöchel, TIrving, SMiddleton, DSMowbray, CEPerros, MRingrose, HSwain, NAWebster, RWestby, MPhillips, C Novel Indazole Non-Nucleoside Reverse Transcriptase Inhibitors Using Molecular Hybridization Based on Crystallographic Overlays (dagger). J Med Chem 52:1219-23 (2009)  
Target
Name:
Gag-Pol polyprotein [588-1027,K691N]/[588-1147,K690N]
Synonyms:
HIV-1 Reverse Transcriptase Mutant (K103N)
Type:
Protein Complex
Mol. Mass.:
Description:
Components:
This complex has 2 components.
Component 1
Name:
Gag-Pol polyprotein [588-1147,K690N]
Synonyms:
HIV-1 Reverse Transcriptase Mutant (K103N) Chain A gag-pol
Type:
Enzyme Subunit
Mol. Mass.:
64471.33
Organism:
Human immunodeficiency virus type 1
Description:
P04585[588-1147,K690N]
Residue:
560
  
Component 2
Name:
Gag-Pol polyprotein [588-1027,K691N]
Synonyms:
HIV-1 Reverse Transcriptase Mutant (K103N) Chain B gag-pol
Type:
Enzyme Subunit
Mol. Mass.:
51322.05
Organism:
Human immunodeficiency virus type 1
Description:
P04585[588-1027,K691N]
Residue:
440
  
Inhibitor
Name:
BDBM2483
Synonyms:
(4S)-6-chloro-4-(2-cyclopropylethynyl)-4-(trifluoromethyl)-2,4-dihydro-1H-3,1-benzoxazin-2-one DMP-266 Efavirenz L-743,726 | Sustiva
Type:
Small organic molecule
Emp. Form.:
C14H9ClF3NO2
Mol. Mass.:
315.675
SMILES:
FC(F)(F)[C@]1(OC(=O)Nc2ccc(Cl)cc12)C#CC1CC1
:
Substrate
Name:
poly r(A).oligo d(T)16
Synonyms:
Type:
RNA/DNA duplex
Mol. Mass.:
358.43
Organism:
Description:
Tritium-labeled TTP is co-substrate.
Residue:
3
NA