Target
Sphingosine 1-phosphate receptor 1
Ligand
BDBM50250631
Substrate
Meas. Tech.
ChEBML_1682036
EC50
0.028600±n/a nM
Citation
 Kurata, HKusumi, KOtsuki, KSuzuki, RKurono, MKomiya, THagiya, HMizuno, HShioya, HOno, TTakada, YMaeda, TMatsunaga, NKondo, TTominaga, SNunoya, KIKiyoshi, HKomeno, MNakade, SHabashita, H Discovery of a 1-Methyl-3,4-dihydronaphthalene-Based Sphingosine-1-Phosphate (S1P) Receptor Agonist Ceralifimod (ONO-4641). A S1P J Med Chem 60:9508-9530 (2017)  
Target
Name:
Sphingosine 1-phosphate receptor 1
Synonyms:
CD_antigen=CD363 Endothelial differentiation G-protein coupled receptor 1 S1P receptor Edg-1 S1PR1_RAT Sphingosine 1-phosphate receptor Edg-1
Type:
PROTEIN
Mol. Mass.:
42770.88
Organism:
Rattus norvegicus
Description:
ChEMBL_1463793
Residue:
383
  
Inhibitor
Name:
BDBM50250631
Synonyms:
CHEMBL4093489
Type:
Small organic molecule
Emp. Form.:
C27H33NO4
Mol. Mass.:
435.5552
SMILES:
CCCc1ccc(COc2ccc3C(C)=C(CN4CC(C4)C(O)=O)CCc3c2)c(OC)c1
: