Target
Cannabinoid receptor 2
Ligand
BDBM50061117
Substrate
Meas. Tech.
ChEMBL_1728611 (CHEMBL4143889)
EC50
73±n/a nM
Citation
 Pollastro, FCaprioglio, DMarotta, PMoriello, ASDe Petrocellis, LTaglialatela-Scafati, OAppendino, G Iodine-Promoted Aromatization of p-Menthane-Type Phytocannabinoids. J Nat Prod 81:630-633 (2018)  
Target
Name:
Cannabinoid receptor 2
Synonyms:
CANNABINOID CB2 CB2 CB2B CNR2_HUMAN Cannabinoid CB2 receptor Cannabinoid receptor 2 (CB2R) | hCB2
Type:
G Protein-Coupled Receptor (GPCR)
Mol. Mass.:
39690.94
Organism:
Homo sapiens (Human)
Description:
P34972
Residue:
360
  
Inhibitor
Name:
BDBM50061117
Synonyms:
6,6,9-Trimethyl-3-pentyl-6H-benzo[c]chromen-1-ol 6,6,9-Trimethyl-3-pentyl-6H-benzo[c]chromen-1-ol(Cannabinol) CBN | CHEMBL74415
Type:
Small organic molecule
Emp. Form.:
C21H26O2
Mol. Mass.:
310.4299
SMILES:
CCCCCc1cc(O)c-2c(OC(C)(C)c3ccc(C)cc-23)c1
: