Target
Tubulin beta chain
Ligand
BDBM50474290
Substrate
Meas. Tech.
ChEMBL_156792 (CHEMBL756956)
IC50
480±n/a nM
Citation
 Prinz, HIshii, YHirano, TStoiber, TCamacho Gomez, JASchmidt, PDüssmann, HBurger, AMPrehn, JHGünther, EGUnger, EUmezawa, K Novel benzylidene-9(10H)-anthracenones as highly active antimicrotubule agents. Synthesis, antiproliferative activity, and inhibition of tubulin polymerization. J Med Chem 46:3382-94 (2003)  
Target
Name:
Tubulin beta chain
Synonyms:
Beta-tubulin Tubulin beta chain
Type:
PROTEIN
Mol. Mass.:
49840.26
Organism:
Sus scrofa
Description:
ChEMBL_105107
Residue:
445
  
Inhibitor
Name:
BDBM50474290
Synonyms:
CHEMBL115499
Type:
Small organic molecule
Emp. Form.:
C21H12Br2O2
Mol. Mass.:
456.127
SMILES:
[#8]-c1c(Br)cc(\[#6]=[#6]-2\c3ccccc3-[#6](=O)-c3ccccc-23)cc1Br
: