Target
Lysine-specific demethylase 3A
Ligand
BDBM50396018
Substrate
Meas. Tech.
ChEMBL_1287258 (CHEMBL3110469)
IC50
170±n/a nM
Citation
 Rotili, DTomassi, SConte, MBenedetti, RTortorici, MCiossani, GValente, SMarrocco, BLabella, DNovellino, EMattevi, AAltucci, LTumber, AYapp, CKing, ONHopkinson, RJKawamura, ASchofield, CJMai, A Pan-histone demethylase inhibitors simultaneously targeting Jumonji C and lysine-specific demethylases display high anticancer activities. J Med Chem 57:42-55 (2014)  
Target
Name:
Lysine-specific demethylase 3A
Synonyms:
JHDM2A JMJD1A Jumonji domain-containing protein 1A KDM3A_HUMAN Lysine-specific demethylase 3A (KDM3A) | TSGA
Type:
PROTEIN
Mol. Mass.:
147368.22
Organism:
Homo sapiens (Human)
Description:
Q9Y4C1
Residue:
1321
  
Inhibitor
Name:
BDBM50396018
Synonyms:
CHEMBL1230640
Type:
Small organic molecule
Emp. Form.:
C10H7NO3
Mol. Mass.:
189.1675
SMILES:
OC(=O)c1ccc(O)c2ncccc12
: