Target
Renin
Ligand
BDBM50045689
Substrate
Meas. Tech.
ChEMBL_195976 (CHEMBL807682)
IC50
5.3±n/a nM
Citation
 Heitsch, HHenning, RKleemann, HWLinz, WNickel, WURuppert, DUrbach, HWagner, A Renin inhibitors containing a pyridyl amino diol derived C-terminus. J Med Chem 36:2788-800 (1993)  
Target
Name:
Renin
Synonyms:
Angiotensinogenase RENI_HUMAN
Type:
Enzyme
Mol. Mass.:
45058.99
Organism:
Homo sapiens (Human)
Description:
Residue:
406
  
Inhibitor
Name:
BDBM50045689
Synonyms:
4-Amino-cyclohexanecarboxylic acid [1-[1-(1-cyclohexylmethyl-2,3-dihydroxy-5-pyridin-2-yl-pentylcarbamoyl)-2-(1H-imidazol-4-yl)-ethylcarbamoyl]-2-(4-methoxy-phenyl)-ethyl]-amide | CHEMBL94539
Type:
Small organic molecule
Emp. Form.:
C40H57N7O6
Mol. Mass.:
731.9239
SMILES:
COc1ccc(C[C@H](NC(=O)[C@@H]2CC[C@H](N)CC2)C(=O)N[C@@H](Cc2cnc[nH]2)C(=O)N[C@@H](CC2CCCCC2)[C@@H](O)[C@@H](O)CCc2ccccn2)cc1
: