Target
Renin
Ligand
BDBM50045682
Substrate
Meas. Tech.
ChEBML_196430
IC50
0.680000±n/a nM
Citation
 Heitsch, HHenning, RKleemann, HWLinz, WNickel, WURuppert, DUrbach, HWagner, A Renin inhibitors containing a pyridyl amino diol derived C-terminus. J Med Chem 36:2788-800 (1993)  
Target
Name:
Renin
Synonyms:
Angiotensinogenase RENI_HUMAN
Type:
Enzyme
Mol. Mass.:
45058.99
Organism:
Homo sapiens (Human)
Description:
Residue:
406
  
Inhibitor
Name:
BDBM50045682
Synonyms:
2-[4-(4-Amino-piperidin-1-yl)-2-benzyl-4-oxo-butyrylamino]-pentanoic acid (1-cyclohexylmethyl-2,3-dihydroxy-5-pyridin-2-yl-pentyl)-amide | CHEMBL96796
Type:
Small organic molecule
Emp. Form.:
C38H57N5O5
Mol. Mass.:
663.8897
SMILES:
CCC[C@H](NC(=O)[C@@H](CC(=O)N1CCC(N)CC1)Cc1ccccc1)C(=O)N[C@@H](CC1CCCCC1)[C@@H](O)[C@@H](O)CCc1ccccn1
: