Target
Renin
Ligand
BDBM50045681
Substrate
Meas. Tech.
ChEMBL_195976 (CHEMBL807682)
IC50
0.470000±n/a nM
Citation
 Heitsch, HHenning, RKleemann, HWLinz, WNickel, WURuppert, DUrbach, HWagner, A Renin inhibitors containing a pyridyl amino diol derived C-terminus. J Med Chem 36:2788-800 (1993)  
Target
Name:
Renin
Synonyms:
Angiotensinogenase RENI_HUMAN
Type:
Enzyme
Mol. Mass.:
45058.99
Organism:
Homo sapiens (Human)
Description:
Residue:
406
  
Inhibitor
Name:
BDBM50045681
Synonyms:
4-Amino-cyclohexanecarboxylic acid {1-[1-(1-cyclohexylmethyl-2,3-dihydroxy-5-pyridin-2-yl-pentylcarbamoyl)-2-(1H-imidazol-4-yl)-ethylcarbamoyl]-2-phenyl-ethyl}-amide | CHEMBL93763
Type:
Small organic molecule
Emp. Form.:
C39H55N7O5
Mol. Mass.:
701.8979
SMILES:
N[C@H]1CC[C@H](CC1)C(=O)N[C@@H](Cc1ccccc1)C(=O)N[C@@H](Cc1cnc[nH]1)C(=O)N[C@@H](CC1CCCCC1)[C@@H](O)[C@@H](O)CCc1ccccn1
: