Target
Renin
Ligand
BDBM50045690
Substrate
Meas. Tech.
ChEMBL_195976 (CHEMBL807682)
IC50
1.1±n/a nM
Citation
 Heitsch, HHenning, RKleemann, HWLinz, WNickel, WURuppert, DUrbach, HWagner, A Renin inhibitors containing a pyridyl amino diol derived C-terminus. J Med Chem 36:2788-800 (1993)  
Target
Name:
Renin
Synonyms:
Angiotensinogenase RENI_HUMAN
Type:
Enzyme
Mol. Mass.:
45058.99
Organism:
Homo sapiens (Human)
Description:
Residue:
406
  
Inhibitor
Name:
BDBM50045690
Synonyms:
2-Benzyl-N-[1-(1-cyclohexylmethyl-2,3-dihydroxy-5-pyridin-2-yl-pentylcarbamoyl)-2-(1H-imidazol-4-yl)-ethyl]-4-morpholin-4-yl-4-oxo-butyramide | CHEMBL327190
Type:
Small organic molecule
Emp. Form.:
C38H52N6O6
Mol. Mass.:
688.8561
SMILES:
O[C@@H](CCc1ccccn1)[C@H](O)[C@H](CC1CCCCC1)NC(=O)[C@H](Cc1cnc[nH]1)NC(=O)[C@@H](CC(=O)N1CCOCC1)Cc1ccccc1
: