Target
Renin
Ligand
BDBM50045684
Substrate
Meas. Tech.
ChEBML_196430
IC50
0.700000±n/a nM
Citation
 Heitsch, HHenning, RKleemann, HWLinz, WNickel, WURuppert, DUrbach, HWagner, A Renin inhibitors containing a pyridyl amino diol derived C-terminus. J Med Chem 36:2788-800 (1993)  
Target
Name:
Renin
Synonyms:
Angiotensinogenase RENI_HUMAN
Type:
Enzyme
Mol. Mass.:
45058.99
Organism:
Homo sapiens (Human)
Description:
Residue:
406
  
Inhibitor
Name:
BDBM50045684
Synonyms:
3-(4-Amino-piperidine-1-sulfonyl)-2-benzyl-N-[1-(1-cyclohexylmethyl-2,3-dihydroxy-5-pyridin-2-yl-pentylcarbamoyl)-2-(1H-imidazol-4-yl)-ethyl]-propionamide | CHEMBL329808
Type:
Small organic molecule
Emp. Form.:
C38H55N7O6S
Mol. Mass.:
737.952
SMILES:
NC1CCN(CC1)S(=O)(=O)C[C@@H](Cc1ccccc1)C(=O)N[C@@H](Cc1cnc[nH]1)C(=O)N[C@@H](CC1CCCCC1)[C@@H](O)[C@@H](O)CCc1ccccn1
: