Target
Renin
Ligand
BDBM50045691
Substrate
Meas. Tech.
ChEMBL_195975 (CHEMBL807523)
IC50
0.160000±n/a nM
Citation
 Heitsch, HHenning, RKleemann, HWLinz, WNickel, WURuppert, DUrbach, HWagner, A Renin inhibitors containing a pyridyl amino diol derived C-terminus. J Med Chem 36:2788-800 (1993)  
Target
Name:
Renin
Synonyms:
Angiotensinogenase RENI_HUMAN
Type:
Enzyme
Mol. Mass.:
45058.99
Organism:
Homo sapiens (Human)
Description:
Residue:
406
  
Inhibitor
Name:
BDBM50045691
Synonyms:
CHEMBL94827 | Methyl-{2-[methyl-(morpholine-4-carbonyl)-amino]-ethyl}-carbamic acid 1-[1-(1-cyclohexylmethyl-2,3-dihydroxy-5-pyridin-2-yl-pentylcarbamoyl)-2-(1H-imidazol-4-yl)-ethylcarbamoyl]-2-phenyl-ethyl ester
Type:
Small organic molecule
Emp. Form.:
C42H60N8O8
Mol. Mass.:
804.9746
SMILES:
CN(CCN(C)C(=O)N1CCOCC1)C(=O)O[C@@H](Cc1ccccc1)C(=O)N[C@@H](Cc1cnc[nH]1)C(=O)N[C@@H](CC1CCCCC1)[C@@H](O)[C@@H](O)CCc1ccccn1
: