Target
Renin
Ligand
BDBM50045685
Substrate
Meas. Tech.
ChEMBL_195976 (CHEMBL807682)
IC50
0.250000±n/a nM
Citation
 Heitsch, HHenning, RKleemann, HWLinz, WNickel, WURuppert, DUrbach, HWagner, A Renin inhibitors containing a pyridyl amino diol derived C-terminus. J Med Chem 36:2788-800 (1993)  
Target
Name:
Renin
Synonyms:
Angiotensinogenase RENI_HUMAN
Type:
Enzyme
Mol. Mass.:
45058.99
Organism:
Homo sapiens (Human)
Description:
Residue:
406
  
Inhibitor
Name:
BDBM50045685
Synonyms:
4-(4-Amino-piperidin-1-yl)-2-benzyl-N-[1-(1-cyclohexylmethyl-2,3-dihydroxy-5-pyridin-2-yl-pentylcarbamoyl)-2-methylsulfanyl-ethyl]-4-oxo-butyramide | CHEMBL330474
Type:
Small organic molecule
Emp. Form.:
C37H55N5O5S
Mol. Mass.:
681.928
SMILES:
CSC[C@H](NC(=O)[C@@H](CC(=O)N1CCC(N)CC1)Cc1ccccc1)C(=O)N[C@@H](CC1CCCCC1)[C@@H](O)[C@@H](O)CCc1ccccn1
: