Target
Transient receptor potential cation channel subfamily V member 2
Ligand
BDBM50318484
Substrate
Meas. Tech.
ChEMBL_2022063 (CHEMBL4675876)
IC50
1100±n/a nM
Citation
 Chianese, GLopatriello, ASchiano-Moriello, ACaprioglio, DMattoteia, DBenetti, ECiceri, DArnoldi, LDe Combarieu, EVitale, RMAmodeo, PAppendino, GDe Petrocellis, LTaglialatela-Scafati, O Cannabitwinol, a Dimeric Phytocannabinoid from Hemp,  J Nat Prod 83:2727-2736 (2020)  
Target
Name:
Transient receptor potential cation channel subfamily V member 2
Synonyms:
Sac2b Transient receptor potential cation channel subfamily V member 2 Vanilloid receptor | Vrl1
Type:
PROTEIN
Mol. Mass.:
86707.60
Organism:
Rattus norvegicus
Description:
ChEMBL_768011
Residue:
761
  
Inhibitor
Name:
BDBM50318484
Synonyms:
2-((1R,6R)-6-Isopropenyl-3-methyl-cyclohex-2-enyl)-5-pentyl-benzene-1,3-diol CHEMBL190461
Type:
Small organic molecule
Emp. Form.:
C21H30O2
Mol. Mass.:
314.4617
SMILES:
CCCCCc1cc(O)c([C@@H]2C=C(C)CC[C@H]2C(C)=C)c(O)c1
: