Target
Fatty-acid amide hydrolase 1
Ligand
BDBM50560623
Substrate
Meas. Tech.
ChEMBL_2072576 (CHEMBL4728110)
IC50
150±n/a nM
Citation
 Keith, JMJones, WPierce, JMSeierstad, MPalmer, JAWebb, MKarbarz, MScott, BPWilson, SJLuo, LWennerholm, MChang, LRizzolio, MRynberg, RChaplan, SGuy Breitenbucher, J Heteroarylureas with fused bicyclic diamine cores as inhibitors of fatty acid amide hydrolase. Bioorg Med Chem Lett 30:0 (2020)  
Target
Name:
Fatty-acid amide hydrolase 1
Synonyms:
Anandamide amidohydrolase FAAH FAAH1_HUMAN Fatty-acid amide hydrolase (FAAH) Oleamide hydrolase 1
Type:
Protein
Mol. Mass.:
63071.19
Organism:
Homo sapiens (Human)
Description:
O00519
Residue:
579
  
Inhibitor
Name:
BDBM50560623
Synonyms:
CHEMBL4780073
Type:
Small organic molecule
Emp. Form.:
C27H26ClN5O2
Mol. Mass.:
487.981
SMILES:
[H][C@]12CCN(C(=O)Nc3cnc4[nH]ccc4c3)[C@@]1([H])CN(Cc1cccc(Oc3ccc(Cl)cc3)c1)C2
: