Target
Fatty-acid amide hydrolase 1
Ligand
BDBM50560625
Substrate
Meas. Tech.
ChEMBL_2072576 (CHEMBL4728110)
IC50
371±n/a nM
Citation
 Keith, JMJones, WPierce, JMSeierstad, MPalmer, JAWebb, MKarbarz, MScott, BPWilson, SJLuo, LWennerholm, MChang, LRizzolio, MRynberg, RChaplan, SGuy Breitenbucher, J Heteroarylureas with fused bicyclic diamine cores as inhibitors of fatty acid amide hydrolase. Bioorg Med Chem Lett 30:0 (2020)  
Target
Name:
Fatty-acid amide hydrolase 1
Synonyms:
Anandamide amidohydrolase FAAH FAAH1_HUMAN Fatty-acid amide hydrolase (FAAH) Oleamide hydrolase 1
Type:
Protein
Mol. Mass.:
63071.19
Organism:
Homo sapiens (Human)
Description:
O00519
Residue:
579
  
Inhibitor
Name:
BDBM50560625
Synonyms:
CHEMBL4748150
Type:
Small organic molecule
Emp. Form.:
C24H23Cl2N5O2
Mol. Mass.:
484.378
SMILES:
[H][C@@]12CN(Cc3cccc(Oc4ccc(Cl)cc4)c3)C[C@]1([H])CN(C2)C(=O)Nc1ccc(Cl)nn1
: