Target
Fatty-acid amide hydrolase 1
Ligand
BDBM50560637
Substrate
Meas. Tech.
ChEMBL_2072576 (CHEMBL4728110)
IC50
146±n/a nM
Citation
 Keith, JMJones, WPierce, JMSeierstad, MPalmer, JAWebb, MKarbarz, MScott, BPWilson, SJLuo, LWennerholm, MChang, LRizzolio, MRynberg, RChaplan, SGuy Breitenbucher, J Heteroarylureas with fused bicyclic diamine cores as inhibitors of fatty acid amide hydrolase. Bioorg Med Chem Lett 30:0 (2020)  
Target
Name:
Fatty-acid amide hydrolase 1
Synonyms:
Anandamide amidohydrolase FAAH FAAH1_HUMAN Fatty-acid amide hydrolase (FAAH) Oleamide hydrolase 1
Type:
Protein
Mol. Mass.:
63071.19
Organism:
Homo sapiens (Human)
Description:
O00519
Residue:
579
  
Inhibitor
Name:
BDBM50560637
Synonyms:
CHEMBL4799311
Type:
Small organic molecule
Emp. Form.:
C26H24ClN7O2
Mol. Mass.:
501.967
SMILES:
Clc1ccc(Oc2cccc(CN3CC4CC3CN4C(=O)Nc3ccc(nc3)-n3nccn3)c2)cc1
: