Target
Fatty-acid amide hydrolase 1 [30-579]
Ligand
BDBM50560652
Substrate
Meas. Tech.
ChEMBL_2072577 (CHEMBL4728111)
IC50
3.3±n/a nM
Citation
 Keith, JMJones, WPierce, JMSeierstad, MPalmer, JAWebb, MKarbarz, MScott, BPWilson, SJLuo, LWennerholm, MChang, LRizzolio, MRynberg, RChaplan, SGuy Breitenbucher, J Heteroarylureas with fused bicyclic diamine cores as inhibitors of fatty acid amide hydrolase. Bioorg Med Chem Lett 30:0 (2020)  
Target
Name:
Fatty-acid amide hydrolase 1 [30-579]
Synonyms:
Anandamide amidohydrolase 1 Faah Fatty Acid Amide Hydrolase Fatty-acid amide hydrolase (FAAH) Fatty-acid amide hydrolase 1 (FAAH) Oleamide hydrolase 1
Type:
Single-pass membrane protein; homodimer
Mol. Mass.:
60474.00
Organism:
Rattus norvegicus (rat)
Description:
P97612 (aa 30-579)
Residue:
550
  
Inhibitor
Name:
BDBM50560652
Synonyms:
CHEMBL4777574
Type:
Small organic molecule
Emp. Form.:
C27H25ClN4O3
Mol. Mass.:
488.965
SMILES:
[H][C@@]12CN(Cc3cccc(Oc4ccc(Cl)cc4)c3)C[C@]1([H])CN(C2)C(=O)Nc1noc2ccccc12
: