Target
Integrase
Ligand
BDBM50187196
Substrate
Meas. Tech.
ChEMBL_383533 (CHEMBL867996)
IC50
7±n/a nM
Citation
 Fardis, MJin, HJabri, SCai, RZMish, MTsiang, MKim, CU Effect of substitution on novel tricyclic HIV-1 integrase inhibitors. Bioorg Med Chem Lett 16:4031-5 (2006)  
Target
Name:
Integrase
Synonyms:
Human immunodeficiency virus type 1 integrase
Type:
PROTEIN
Mol. Mass.:
32231.48
Organism:
Human immunodeficiency virus 1
Description:
ChEMBL_90865
Residue:
288
  
Inhibitor
Name:
BDBM50187196
Synonyms:
2'-[(4-fluorophenyl)methyl]-4'-hydroxy-9'-methoxy-2',3'-dihydrospiro[cyclopropane-1,1'-pyrrolo[3,4-g]quinoline]-3'-one | CHEMBL212412
Type:
Small organic molecule
Emp. Form.:
C21H17FN2O3
Mol. Mass.:
364.3697
SMILES:
COc1c2c(C(=O)N(Cc3ccc(F)cc3)C22CC2)c(O)c2ncccc12
: