Target
Vascular endothelial growth factor receptor 2
Ligand
BDBM50173019
Substrate
Meas. Tech.
ChEMBL_495687 (CHEMBL1006966)
IC50
78±n/a nM
Citation
 Duncton, MAPiatnitski Chekler, ELKatoch-Rouse, RSherman, DWong, WCSmith, LMKawakami, JKKiselyov, ASMilligan, DLBalagtas, CHadari, YRWang, YPatel, SNRolster, RLTonra, JRSurguladze, DMitelman, SKussie, PBohlen, PDoody, JF Arylphthalazines as potent, and orally bioavailable inhibitors of VEGFR-2. Bioorg Med Chem 17:731-40 (2009)  
Target
Name:
Vascular endothelial growth factor receptor 2
Synonyms:
CD_antigen=CD309 Fetal liver kinase 1 (FLK-1) KDR Protein-tyrosine kinase receptor Flk-1 VEGFR-2 VEGFR2 Vascular Endothelial Growth Factor Receptor Kinase 2 Vascular endothelial growth factor receptor 2 (KDR) Vascular endothelial growth factor receptor 2 (VEGFR2) Vascular endothelial growth factor receptor-2 (VEGFR-2)
Type:
Receptor Tyrosine Kinase
Mol. Mass.:
151510.97
Organism:
Homo sapiens (Human)
Description:
P35968
Residue:
1356
  
Inhibitor
Name:
BDBM50173019
Synonyms:
4-(4-(4-tert-butylphenylamino)phthalazin-1-yl)benzamide CHEMBL370586 | IM-094261
Type:
Small organic molecule
Emp. Form.:
C25H24N4O
Mol. Mass.:
396.4843
SMILES:
CC(C)(C)c1ccc(Nc2nnc(-c3ccc(cc3)C(N)=O)c3ccccc23)cc1
: