Target
Cysteinyl leukotriene receptor 1
Ligand
BDBM50284680
Substrate
Meas. Tech.
ChEBML_99992
Ki
650±n/a nM
Citation
 Andrews, EGAntognoli, GWBreslow, RCarta, MPCarty, TJChambers, RJCheng, JBCohan, VLCollins, JLDamon, DBDelehunt, JEggler, JFEskra, JDFreiert, KWHada, WAMarfat, AMasamune, HMelvin, LSMularski, CJNaclerio, BA Synthesis and pharmacological profile of two novel heterocyclic chromanols, CP-80,798 and CP-85,958, as potent LTD4 receptor antagonists Bioorg Med Chem Lett 5:1365-1370 (1995)    Article 
Target
Name:
Cysteinyl leukotriene receptor 1
Synonyms:
CLTR1_CAVPO | CYSLTR1
Type:
Enzyme Catalytic Domain
Mol. Mass.:
39007.58
Organism:
GUINEA PIG
Description:
Leukotriene D4 0 GUINEA PIG::Q2NNR5
Residue:
340
  
Inhibitor
Name:
BDBM50284680
Synonyms:
(3S,4S)-3-Pyridin-3-ylmethyl-6-(quinolin-2-ylmethoxy)-chroman-4-ol CHEMBL282524 | CP-80798
Type:
Small organic molecule
Emp. Form.:
C25H22N2O3
Mol. Mass.:
398.4538
SMILES:
O[C@H]1[C@@H](Cc2cccnc2)COc2ccc(OCc3ccc4ccccc4n3)cc12
: