Target
cAMP-dependent protein kinase catalytic subunit alpha/beta/gamma
Ligand
BDBM50290422
Substrate
Meas. Tech.
ChEMBL_161903 (CHEMBL767982)
IC50
475000±n/a nM
Citation
 Zimmermann, JBuchdunger, EMett, HMeyer, TLydon, NB Potent and selective inhibitors of the Abl-kinase: phenylamino-pyrimidine (PAP) derivatives Bioorg Med Chem Lett 7:187-192 (1997)    Article 
Target
Name:
cAMP-dependent protein kinase catalytic subunit alpha/beta/gamma
Synonyms:
cAMP-dependent protein kinase (PKA)
Type:
Mol. Mass.:
Description:
ASSAY_ID of ChEMBL is 217489
Components:
This complex has 3 components.
Component 1
Name:
cAMP-dependent protein kinase catalytic subunit beta
Synonyms:
KAPCB_HUMAN PKAC-beta cAMP-dependent protein kinase (PKA) cAMP-dependent protein kinase catalytic subunit beta
Type:
PROTEIN
Mol. Mass.:
40631.25
Organism:
Homo sapiens (Human)
Description:
ChEMBL_586348
Residue:
351
  
Component 2
Name:
cAMP-dependent protein kinase catalytic subunit alpha
Synonyms:
KAPCA_HUMAN PKACA cAMP-dependent protein kinase (PKA) cAMP-dependent protein kinase catalytic subunit alpha cAMP-dependent protein kinase catalytic subunit alpha (PKACA) cAMP-dependent protein kinase catalytic subunit alpha isoform 1 | cAMP-dependent protein kinase, alpha-catalytic subunit
Type:
Enzyme Catalytic Subunit
Mol. Mass.:
40598.73
Organism:
Homo sapiens (Human)
Description:
Residue:
351
  
Component 3
Name:
cAMP-dependent protein kinase catalytic subunit gamma
Synonyms:
KAPCG_HUMAN PRKACG cAMP-dependent protein kinase catalytic subunit gamma
Type:
PROTEIN
Mol. Mass.:
40442.03
Organism:
Homo sapiens (Human)
Description:
ChEMBL_104720
Residue:
351
  
Inhibitor
Name:
BDBM50290422
Synonyms:
4-(4-Methyl-piperazin-1-ylmethyl)-N-[3-(4-pyridin-3-yl-pyrimidin-2-ylamino)-phenyl]-benzamide CHEMBL56904
Type:
Small organic molecule
Emp. Form.:
C28H29N7O
Mol. Mass.:
479.5762
SMILES:
CN1CCN(Cc2ccc(cc2)C(=O)Nc2cccc(Nc3nccc(n3)-c3cccnc3)c2)CC1
: