Target
Platelet-derived growth factor receptor alpha/beta
Ligand
BDBM50290422
Substrate
Meas. Tech.
ChEMBL_158502 (CHEMBL765715)
IC50
200±n/a nM
Citation
 Zimmermann, JBuchdunger, EMett, HMeyer, TLydon, NB Potent and selective inhibitors of the Abl-kinase: phenylamino-pyrimidine (PAP) derivatives Bioorg Med Chem Lett 7:187-192 (1997)    Article 
Target
Name:
Platelet-derived growth factor receptor alpha/beta
Synonyms:
PDGFR-beta/Platelet-derived growth factor receptor alpha Platelet-derived growth factor receptor alpha /beta
Type:
Mol. Mass.:
Description:
ASSAY_ID of EBI is 29498
Components:
This complex has 2 components.
Component 1
Name:
Platelet-derived growth factor receptor beta
Synonyms:
Beta-type platelet-derived growth factor receptor CD140b antigen PDGF Receptor Substrate PDGFR PDGFR-1 PDGFRB PGFRB_HUMAN Platelet-derived growth factor receptor 1 Platelet-derived growth factor receptor beta (PDGFR-beta) Platelet-derived growth factor receptor beta (PDGFRbeta) | VHL/PDGFRB
Type:
Enzyme
Mol. Mass.:
123922.25
Organism:
Homo sapiens (Human)
Description:
P09619
Residue:
1106
  
Component 2
Name:
Platelet-derived growth factor receptor alpha
Synonyms:
Alpha-type platelet-derived growth factor receptor PDGFRA PGFRA_HUMAN Platelet-derived growth factor receptor alpha (PDGFRA) RHEPDGFRA
Type:
Protein
Mol. Mass.:
122633.38
Organism:
Homo sapiens (Human)
Description:
P16234
Residue:
1089
  
Inhibitor
Name:
BDBM50290422
Synonyms:
4-(4-Methyl-piperazin-1-ylmethyl)-N-[3-(4-pyridin-3-yl-pyrimidin-2-ylamino)-phenyl]-benzamide CHEMBL56904
Type:
Small organic molecule
Emp. Form.:
C28H29N7O
Mol. Mass.:
479.5762
SMILES:
CN1CCN(Cc2ccc(cc2)C(=O)Nc2cccc(Nc3nccc(n3)-c3cccnc3)c2)CC1
: