Target
Glutamate receptor ionotropic, NMDA 2B
Ligand
BDBM50344250
Substrate
Meas. Tech.
ChEMBL_748229 (CHEMBL1781192)
Ki
12±n/a nM
Citation
 Brown, DGMaier, DLSylvester, MAHoerter, TNMenhaji-Klotz, ELasota, CCHirata, LTWilkins, DEScott, CWTrivedi, SChen, TMcCarthy, DJMaciag, CMSutton, EJCumberledge, JMathisen, DRoberts, JGupta, ALiu, FElmore, CSAlhambra, CKrumrine, JRWang, XCiaccio, PJWood, MWCampbell, JBJohansson, MJXia, JWen, XJiang, JWang, XPeng, ZHu, TWang, J 2,6-Disubstituted pyrazines and related analogs as NR2B site antagonists of the NMDA receptor with anti-depressant activity. Bioorg Med Chem Lett 21:3399-403 (2011)  
Target
Name:
Glutamate receptor ionotropic, NMDA 2B
Synonyms:
GluN2B Grin2b NMDA receptor subunit N2B (GluN2B) NMDE2_RAT | NR2B
Type:
Protein
Mol. Mass.:
166077.66
Organism:
Rattus norvegicus (Rat)
Description:
Q00960
Residue:
1482
  
Inhibitor
Name:
BDBM50344250
Synonyms:
CHEMBL1779003 | N-((5-(4-fluoro-2-methoxyphenyl)pyridin-3-yl)methyl)cyclopentanamine
Type:
Small organic molecule
Emp. Form.:
C18H21FN2O
Mol. Mass.:
300.3705
SMILES:
COc1cc(F)ccc1-c1cncc(CNC2CCCC2)c1
: