Target
Stearoyl-CoA desaturase
Ligand
BDBM50354677
Substrate
Meas. Tech.
ChEMBL_771238 (CHEMBL1839320)
IC50
16±n/a nM
Citation
 Ramtohul, YKPowell, DLeclerc, JPLeger, SOballa, RBlack, CIsabel, ELi, CSCrane, SRobichaud, JGuay, JGuiral, SZhang, LHuang, Z Bicyclic heteroaryl inhibitors of stearoyl-CoA desaturase: from systemic to liver-targeting inhibitors. Bioorg Med Chem Lett 21:5692-6 (2011)  
Target
Name:
Stearoyl-CoA desaturase
Synonyms:
Acyl-CoA desaturase SCD SCDOS Stearoyl-CoA (SCD1) | Stearoyl-CoA desaturase 1
Type:
Enzyme
Mol. Mass.:
41537.27
Organism:
Homo sapiens (Human)
Description:
O00767
Residue:
359
  
Inhibitor
Name:
BDBM50354677
Synonyms:
CHEMBL1834443
Type:
Small organic molecule
Emp. Form.:
C18H17F3N4O3S
Mol. Mass.:
426.413
SMILES:
OCc1nc2nc(sc2c(=O)[nH]1)N1CCC(CC1)Oc1ccccc1C(F)(F)F
: