Target
Calcium/calmodulin-dependent protein kinase type II subunit delta
Ligand
BDBM50374984
Substrate
Meas. Tech.
ChEMBL_470098 (CHEMBL934464)
IC50
750±n/a nM
Citation
 Levy, DEWang, DXLu, QChen, ZPerumattam, JXu, YJLiclican, AHigaki, JDong, HLaney, MMavunkel, BDugar, S Aryl-indolyl maleimides as inhibitors of CaMKIIdelta. Part 1: SAR of the aryl region. Bioorg Med Chem Lett 18:2390-4 (2008)  
Target
Name:
Calcium/calmodulin-dependent protein kinase type II subunit delta
Synonyms:
CAMK2D CaM kinase II CaMK-II subunit delta Calcium/calmodulin-dependent protein kinase type II subunit delta (CAMK2D) KCC2D_HUMAN
Type:
Enzyme Catalytic Domain
Mol. Mass.:
56419.78
Organism:
Homo sapiens (Human)
Description:
Q13557
Residue:
499
  
Inhibitor
Name:
BDBM50374984
Synonyms:
CHEMBL256265
Type:
Small organic molecule
Emp. Form.:
C24H22N4O2
Mol. Mass.:
398.4571
SMILES:
Cc1[nH]c2ccccc2c1C1=C(C(=O)NC1=O)c1cn(CCCN)c2ccccc12
: