Target
Calcium/calmodulin-dependent protein kinase type II subunit delta
Ligand
BDBM50375081
Substrate
Meas. Tech.
ChEMBL_470254 (CHEMBL950209)
IC50
740±n/a nM
Citation
 Lu, QChen, ZPerumattam, JWang, DXLiang, WXu, YJDo, SBonaga, LHigaki, JDong, HLiclican, ASideris, SLaney, MDugar, SMavunkel, BLevy, DE Aryl-indolyl maleimides as inhibitors of CaMKIIdelta. Part 3: Importance of the indole orientation. Bioorg Med Chem Lett 18:2399-403 (2008)  
Target
Name:
Calcium/calmodulin-dependent protein kinase type II subunit delta
Synonyms:
CAMK2D CaM kinase II CaMK-II subunit delta Calcium/calmodulin-dependent protein kinase type II subunit delta (CAMK2D) KCC2D_HUMAN
Type:
Enzyme Catalytic Domain
Mol. Mass.:
56419.78
Organism:
Homo sapiens (Human)
Description:
Q13557
Residue:
499
  
Inhibitor
Name:
BDBM50375081
Synonyms:
CHEMBL401681
Type:
Small organic molecule
Emp. Form.:
C24H22N4O2
Mol. Mass.:
398.4571
SMILES:
Cc1c(C2=C(C(=O)NC2=O)c2c[nH]c3ccccc23)c2ccccc2n1CCCN
: