Target
Adenosine receptor A2a
Ligand
BDBM50394724
Substrate
Meas. Tech.
ChEMBL_858812 (CHEMBL2167687)
Ki
13.1±n/a nM
Citation
 Shook, BCRassnick, SWallace, NCrooke, JAult, MChakravarty, DBarbay, JKWang, APowell, MTLeonard, KAlford, VScannevin, RHCarroll, KLampron, LWestover, LLim, HKRussell, RBranum, SWells, KMDamon, SYouells, SLi, XBeauchamp, DARhodes, KJackson, PF Design and characterization of optimized adenosine A2A/A1 receptor antagonists for the treatment of Parkinson's disease. J Med Chem 55:1402-17 (2012)  
Target
Name:
Adenosine receptor A2a
Synonyms:
A2A adenosine receptor (hA2A) ADENOSINE A2 ADORA2 Adenosine A2A receptor (A2AAR)
Type:
G Protein-Coupled Receptor (GPCR)
Mol. Mass.:
44716.46
Organism:
Homo sapiens (Human)
Description:
P29274
Residue:
412
  
Inhibitor
Name:
BDBM50394724
Synonyms:
CHEMBL2165805
Type:
Small organic molecule
Emp. Form.:
C24H24N4O
Mol. Mass.:
384.4736
SMILES:
CC1CC[C@@H](C)N1Cc1ccc2C(=O)c3c(nc(N)nc3-c3ccccc3)-c2c1
: