Target
Receptor-interacting serine/threonine-protein kinase 2
Ligand
BDBM50184478
Substrate
Meas. Tech.
ChEMBL_1587102 (CHEMBL3825637)
IC50
50±n/a nM
Citation
 Haile, PAVotta, BJMarquis, RWBury, MJMehlmann, JFSinghaus, RCharnley, AKLakdawala, ASConvery, MALipshutz, DBDesai, BMSwift, BCapriotti, CABerger, SBMahajan, MKReilly, MARivera, EJSun, HHNagilla, RBeal, AMFinger, JNCook, MNKing, BWOuellette, MTTotoritis, RDPierdomenico, MNegroni, AStronati, LCucchiara, SZiólkowski, BVossenkämper, AMacDonald, TTGough, PJBertin, JCasillas, LN The Identification and Pharmacological Characterization of 6-(tert-Butylsulfonyl)-N-(5-fluoro-1H-indazol-3-yl)quinolin-4-amine (GSK583), a Highly Potent and Selective Inhibitor of RIP2 Kinase. J Med Chem 59:4867-80 (2016)  
Target
Name:
Receptor-interacting serine/threonine-protein kinase 2
Synonyms:
CARDIAK RIP2 RIPK2_HUMAN Tyrosine-protein kinase RIPK2 | receptor-interacting serine/threonine-protein kinase 2
Type:
Protein
Mol. Mass.:
61201.30
Organism:
Homo sapiens (Human)
Description:
Residue:
540
  
Inhibitor
Name:
BDBM50184478
Synonyms:
CHEMBL3823809
Type:
Small organic molecule
Emp. Form.:
C16H13N5O2S
Mol. Mass.:
339.372
SMILES:
CS(=O)(=O)c1ccc2nccc(Nc3ccc4[nH]nnc4c3)c2c1
: