Target
Receptor-interacting serine/threonine-protein kinase 2
Ligand
BDBM50184620
Substrate
Meas. Tech.
ChEMBL_1587102 (CHEMBL3825637)
IC50
630±n/a nM
Citation
 Haile, PAVotta, BJMarquis, RWBury, MJMehlmann, JFSinghaus, RCharnley, AKLakdawala, ASConvery, MALipshutz, DBDesai, BMSwift, BCapriotti, CABerger, SBMahajan, MKReilly, MARivera, EJSun, HHNagilla, RBeal, AMFinger, JNCook, MNKing, BWOuellette, MTTotoritis, RDPierdomenico, MNegroni, AStronati, LCucchiara, SZiólkowski, BVossenkämper, AMacDonald, TTGough, PJBertin, JCasillas, LN The Identification and Pharmacological Characterization of 6-(tert-Butylsulfonyl)-N-(5-fluoro-1H-indazol-3-yl)quinolin-4-amine (GSK583), a Highly Potent and Selective Inhibitor of RIP2 Kinase. J Med Chem 59:4867-80 (2016)  
Target
Name:
Receptor-interacting serine/threonine-protein kinase 2
Synonyms:
CARDIAK RIP2 RIPK2_HUMAN Tyrosine-protein kinase RIPK2 | receptor-interacting serine/threonine-protein kinase 2
Type:
Protein
Mol. Mass.:
61201.30
Organism:
Homo sapiens (Human)
Description:
Residue:
540
  
Inhibitor
Name:
BDBM50184620
Synonyms:
CHEMBL3822573
Type:
Small organic molecule
Emp. Form.:
C16H14N2O
Mol. Mass.:
250.2952
SMILES:
Cc1ccc(O)cc1Nc1ccnc2ccccc12
: