Target
C-X-C chemokine receptor type 2
Ligand
BDBM50213759
Substrate
Meas. Tech.
ChEMBL_447494 (CHEMBL896517)
IC50
390±n/a nM
Citation
 Wang, YBusch-Petersen, JWang, FMa, LFu, WKerns, JKJin, JPalovich, MRShen, JKBurman, MFoley, JJSchmidt, DBHunsberger, GESarau, HMWiddowson, KL 3-Arylamino-2H-1,2,4-benzothiadiazin-5-ol 1,1-dioxides as novel and selective CXCR2 antagonists. Bioorg Med Chem Lett 17:3864-7 (2007)  
Target
Name:
C-X-C chemokine receptor type 2
Synonyms:
C-X-C chemokine receptor type 2 (CXCR-2) CD_antigen=CD182 CXCR-2 CXCR2_HUMAN GRO/MGSA receptor IL-8 receptor type 2 IL8RB | Interleukin-8 receptor B
Type:
Protein
Mol. Mass.:
40767.88
Organism:
Homo sapiens (Human)
Description:
P25025
Residue:
360
  
Inhibitor
Name:
BDBM50213759
Synonyms:
7-chloro-1,1-dioxo-3-o-tolylamino-1,4-dihydro-1lambda6-benzo[1,2,4]thiadiazin-5-ol | CHEMBL233960
Type:
Small organic molecule
Emp. Form.:
C14H12ClN3O3S
Mol. Mass.:
337.781
SMILES:
Cc1ccccc1NC1=Nc2c(O)cc(Cl)cc2S(=O)(=O)N1
: