Target
Glycogen phosphorylase, liver form
Ligand
BDBM50243305
Substrate
Meas. Tech.
ChEMBL_491667 (CHEMBL946385)
IC50
51000±n/a nM
Citation
 Evans, KALi, YHCoppo, FTGraybill, TLCichy-Knight, MPatel, MGale, JLi, HThrall, SHTew, DTavares, FThomson, SAWeiel, JEBoucheron, JAClancy, DCEpperly, AHGolden, PL Amino acid anthranilamide derivatives as a new class of glycogen phosphorylase inhibitors. Bioorg Med Chem Lett 18:4068-71 (2008)  
Target
Name:
Glycogen phosphorylase, liver form
Synonyms:
Glycogen Phosphorylase (PYGL) Liver glycogen phosphorylase PYGL_HUMAN
Type:
Homodimer
Mol. Mass.:
97153.98
Organism:
Homo sapiens (Human)
Description:
Dimers associate into a tetramer to form the enzymatically active phosphorylase A.
Residue:
847
  
Inhibitor
Name:
BDBM50243305
Synonyms:
(S)-2-(2-(3-(2-chloro-6-methylphenyl)ureido)-2-naphthamido)-3-cyclohexylpropanoic acid | CHEMBL507762
Type:
Small organic molecule
Emp. Form.:
C28H30ClN3O4
Mol. Mass.:
508.009
SMILES:
Cc1cccc(Cl)c1NC(=O)Nc1cc2ccccc2cc1C(=O)N[C@@H](CC1CCCCC1)C(O)=O
: