Target
Sphingosine 1-phosphate receptor 3
Ligand
BDBM50158348
Substrate
Meas. Tech.
ChEMBL_632514 (CHEMBL1111162)
EC50
0.20±n/a nM
Citation
 Bolli, MHAbele, SBinkert, CBravo, RBuchmann, SBur, DGatfield, JHess, PKohl, CMangold, CMathys, BMenyhart, KMüller, CNayler, OScherz, MSchmidt, GSippel, VSteiner, BStrasser, DTreiber, AWeller, T 2-imino-thiazolidin-4-one derivatives as potent, orally active S1P1 receptor agonists. J Med Chem 53:4198-211 (2010)  
Target
Name:
Sphingosine 1-phosphate receptor 3
Synonyms:
C9orf108 EDG3 S1P receptor 3 S1P3 S1PR3_HUMAN Sphingosine 1-phosphate receptor 3 (S1P3) | Sphingosine 1-phosphate receptor Edg-3
Type:
G Protein-Coupled Receptor (GPCR)
Mol. Mass.:
42278.13
Organism:
Homo sapiens (Human)
Description:
Q99500
Residue:
378
  
Inhibitor
Name:
BDBM50158348
Synonyms:
(2S,3R,4E)-2-amino-3-hydroxyoctadec-4-en-1-yl dihydrogen phosphate CHEMBL225155 US11584726, Example S1P sphingosine-1-phosphate
Type:
Small organic molecule
Emp. Form.:
C18H38NO5P
Mol. Mass.:
379.4718
SMILES:
CCCCCCCCCCCCC\C=C\[C@@H](O)[C@@H](N)COP(O)(O)=O
: