Target
Tyrosine-protein kinase JAK1
Ligand
BDBM325429
Substrate
Meas. Tech.
JAK1 Inhibition Assay
IC50
550±n/a nM
Citation
 Allen, SBoys, MLChicarelli, MJFell, JBFischer, JPGaudino, JHicken, EJHinklin, RJKraser, CFLaird, ERobinson, JETang, TPBurgess, LERieger, RAPheneger, JSatoh, YLeftheris, KRaheja, RKBennett, BL 4,6-substituted-pyrazolo[1,5-a]pyrazines as janus kinase inhibitors US Patent  US10189845 Publication Date 1/29/2019 
Target
Name:
Tyrosine-protein kinase JAK1
Synonyms:
JAK-1 JAK1A JAK1_HUMAN Janus kinase 1 (JAK1) | Janus kinase 1 JAK1
Type:
Protein
Mol. Mass.:
133293.73
Organism:
Homo sapiens (Human)
Description:
P23458
Residue:
1154
  
Inhibitor
Name:
BDBM325429
Synonyms:
US10189845, Example 91A US11028093, Example 91
Type:
Small organic molecule
Emp. Form.:
C21H27N7O2
Mol. Mass.:
409.4848
SMILES:
CCC(CC)n1cc(cn1)-c1nc(cn2nccc12)-c1cnn(c1)[C@@H](C)[C@@H](O)CO
: