Target
Peroxisome proliferator-activated receptor gamma
Ligand
BDBM50537147
Substrate
Meas. Tech.
ChEMBL_1935814 (CHEMBL4481573)
EC50
>20000±n/a nM
Citation
 Kotoku, MMaeba, TFujioka, SYokota, MSeki, NIto, KSuwa, YIkenogami, THirata, KHase, YKatsuda, YMiyagawa, NArita, KAsahina, KNoguchi, MNomura, ADoi, SAdachi, TCrowe, PTao, HThacher, SHashimoto, HSuzuki, TShiozaki, M Discovery of Second Generation ROR? Inhibitors Composed of an Azole Scaffold. J Med Chem 62:2837-2842 (2019)  
Target
Name:
Peroxisome proliferator-activated receptor gamma
Synonyms:
NR1C3 PPAR-gamma PPARG_HUMAN Peroxisome proliferator-activated receptor gamma (PPAR gamma) Peroxisome proliferator-activated receptor gamma (PPARĪ³) peroxisome proliferator-activated receptor gamma isoform 2
Type:
Nuclear Receptor
Mol. Mass.:
57613.46
Organism:
Homo sapiens (Human)
Description:
P37231
Residue:
505
  
Inhibitor
Name:
BDBM50537147
Synonyms:
CHEMBL4537625
Type:
Small organic molecule
Emp. Form.:
C26H28Cl2N3NaO5
Mol. Mass.:
556.413
SMILES:
[Na;v0+].[#6]C([#6])([#6])[#6]-c1cc(no1)-c1onc(-[#6@@H](-[#6]-[#6]-[#6](-[#8-])=O)-[#6]-[#6](=O)-[#7]-c2ccc(Cl)cc2Cl)c1-[#6]-1-[#6]-[#6]-1
: