Target
Nuclear receptor ROR-gamma
Ligand
BDBM50537168
Substrate
Meas. Tech.
ChEMBL_1935804 (CHEMBL4481563)
EC50
6.0±n/a nM
Citation
 Kotoku, MMaeba, TFujioka, SYokota, MSeki, NIto, KSuwa, YIkenogami, THirata, KHase, YKatsuda, YMiyagawa, NArita, KAsahina, KNoguchi, MNomura, ADoi, SAdachi, TCrowe, PTao, HThacher, SHashimoto, HSuzuki, TShiozaki, M Discovery of Second Generation ROR? Inhibitors Composed of an Azole Scaffold. J Med Chem 62:2837-2842 (2019)  
Target
Name:
Nuclear receptor ROR-gamma
Synonyms:
NR1F3 Nuclear receptor ROR-gamma (RORC) RAR-related orphan receptor C (RORc) RORG RZRG Retinoid-related orphan receptor-gamma (RORc)
Type:
Enzyme Catalytic Domain
Mol. Mass.:
58218.40
Organism:
Homo sapiens (Human)
Description:
P51449
Residue:
518
  
Inhibitor
Name:
BDBM50537168
Synonyms:
CHEMBL4541987
Type:
Small organic molecule
Emp. Form.:
C26H26ClF3N3NaO5
Mol. Mass.:
575.94
SMILES:
[Na;v0+].[#6]C([#6])([#6])C(F)(F)c1cc(no1)-c1onc(-[#6@@H](-[#6]-[#6]-[#6](-[#8-])=O)-[#6]-[#6](=O)-[#7]-c2ccc(F)cc2Cl)c1-[#6]-1-[#6]-[#6]-1
: