Target
C-X-C chemokine receptor type 1
Ligand
BDBM50193973
Substrate
Meas. Tech.
ChEMBL_424262 (CHEMBL908414)
IC50
22±n/a nM
Citation
 Nie, HWiddowson, KLPalovich, MRFu, WElliott, JDBryan, DLBurman, MSchmidt, DBFoley, JJSarau, HMBusch-Petersen, J N,N'-Diarylcyanoguanidines as antagonists of the CXCR2 and CXCR1 chemokine receptors. Bioorg Med Chem Lett 16:5513-6 (2006)  
Target
Name:
C-X-C chemokine receptor type 1
Synonyms:
C-X-C chemokine receptor type 1 (CXCR-1) CMKAR1 CXCR1_HUMAN Interleukin-8 receptor A | Interleukin-8 receptors, CXCR1/CXCR2
Type:
Enzyme
Mol. Mass.:
39803.83
Organism:
Homo sapiens (Human)
Description:
P25024
Residue:
350
  
Inhibitor
Name:
BDBM50193973
Synonyms:
(R)-1-(3-(3-(3-(2-bromophenyl)-2-cyanoguanidino)-6-chloro-2-hydroxyphenylsulfonamido)pentan-3-yl)pyrrolidine-2-carboxylic acid | CHEMBL387136
Type:
Small organic molecule
Emp. Form.:
C24H28BrClN6O5S
Mol. Mass.:
627.938
SMILES:
CCC(CC)(NS(=O)(=O)c1c(Cl)ccc(N=C(NC#N)Nc2ccccc2Br)c1O)N1CCC[C@@H]1C(O)=O
: