Target
Muscarinic acetylcholine receptor M3
Ligand
BDBM50297133
Substrate
Meas. Tech.
ChEMBL_750511 (CHEMBL1786272)
IC50
206±n/a nM
Citation
 Lainé, DIWan, ZYan, HZhu, CXie, HFu, WBusch-Petersen, JNeipp, CDavis, RWiddowson, KLBlaney, FEFoley, JBacon, AMWebb, EFLuttmann, MABurman, MSarau, HMSalmon, MPalovich, MRBelmonte, K Design, synthesis, and structure-activity relationship of tropane muscarinic acetylcholine receptor antagonists. J Med Chem 52:5241-52 (2010)  
Target
Name:
Muscarinic acetylcholine receptor M3
Synonyms:
ACM3_HUMAN Cholinergic, muscarinic M3 Muscarinic receptor M3 | RecName: Full=Muscarinic acetylcholine receptor M3
Type:
Enzyme
Mol. Mass.:
66151.03
Organism:
Homo sapiens (Human)
Description:
P20309
Residue:
590
  
Inhibitor
Name:
BDBM50297133
Synonyms:
CHEMBL561879 | endo-8-methyl-3-(2,2,2-triphenylethyl)-8-azabicyclo[3.2.1]octane
Type:
Small organic molecule
Emp. Form.:
C28H31N
Mol. Mass.:
381.5524
SMILES:
CN1[C@@H]2CC[C@@H]1CC(CC(c1ccccc1)(c1ccccc1)c1ccccc1)C2
: