Target
Muscarinic acetylcholine receptor M3
Ligand
BDBM50345692
Substrate
Meas. Tech.
ChEMBL_750516 (CHEMBL1786277)
Ki
0.45±n/a nM
Citation
 Lainé, DIWan, ZYan, HZhu, CXie, HFu, WBusch-Petersen, JNeipp, CDavis, RWiddowson, KLBlaney, FEFoley, JBacon, AMWebb, EFLuttmann, MABurman, MSarau, HMSalmon, MPalovich, MRBelmonte, K Design, synthesis, and structure-activity relationship of tropane muscarinic acetylcholine receptor antagonists. J Med Chem 52:5241-52 (2010)  
Target
Name:
Muscarinic acetylcholine receptor M3
Synonyms:
ACM3_HUMAN Cholinergic, muscarinic M3 Muscarinic receptor M3 | RecName: Full=Muscarinic acetylcholine receptor M3
Type:
Enzyme
Mol. Mass.:
66151.03
Organism:
Homo sapiens (Human)
Description:
P20309
Residue:
590
  
Inhibitor
Name:
BDBM50345692
Synonyms:
(3-endo)-3-(2,2-Di-2-thienylethenyl)-8,8-dimethyl-8-azoniabicyclo[3.2.1]octane Bromide | CHEMBL1785081
Type:
Small organic molecule
Emp. Form.:
C19H24NS2
Mol. Mass.:
330.53
SMILES:
[#6][N+]1([#6])[#6@@H]-2-[#6]-[#6]-[#6@@H]1-[#6]-[#6](-[#6]-2)\[#6]=[#6](/c1cccs1)-c1cccs1
: