Target
Muscarinic acetylcholine receptor M2
Ligand
BDBM50345693
Substrate
Meas. Tech.
ChEMBL_750515 (CHEMBL1786276)
Ki
0.17±n/a nM
Citation
 Lainé, DIWan, ZYan, HZhu, CXie, HFu, WBusch-Petersen, JNeipp, CDavis, RWiddowson, KLBlaney, FEFoley, JBacon, AMWebb, EFLuttmann, MABurman, MSarau, HMSalmon, MPalovich, MRBelmonte, K Design, synthesis, and structure-activity relationship of tropane muscarinic acetylcholine receptor antagonists. J Med Chem 52:5241-52 (2010)  
Target
Name:
Muscarinic acetylcholine receptor M2
Synonyms:
ACM2_HUMAN Cholinergic, muscarinic M2 Muscarinic acetylcholine receptor M2 and M5 | RecName: Full=Muscarinic acetylcholine receptor M2
Type:
GPCR
Mol. Mass.:
51730.61
Organism:
Homo sapiens (Human)
Description:
P08172
Residue:
466
  
Inhibitor
Name:
BDBM50345693
Synonyms:
(3-endo)-3-(2-Cyano-2,2-diphenylethyl)-8,8-dimethyl-8-azoniabicyclo[3.2.1]octane Bromide CHEMBL558522
Type:
Small organic molecule
Emp. Form.:
C24H29N2
Mol. Mass.:
345.4999
SMILES:
C[N+]1(C)[C@@H]2CC[C@@H]1CC(CC(C#N)(c1ccccc1)c1ccccc1)C2
: