Target
Muscarinic acetylcholine receptor M3
Ligand
BDBM50345681
Substrate
Meas. Tech.
ChEMBL_750511 (CHEMBL1786272)
IC50
11±n/a nM
Citation
 Lainé, DIWan, ZYan, HZhu, CXie, HFu, WBusch-Petersen, JNeipp, CDavis, RWiddowson, KLBlaney, FEFoley, JBacon, AMWebb, EFLuttmann, MABurman, MSarau, HMSalmon, MPalovich, MRBelmonte, K Design, synthesis, and structure-activity relationship of tropane muscarinic acetylcholine receptor antagonists. J Med Chem 52:5241-52 (2010)  
Target
Name:
Muscarinic acetylcholine receptor M3
Synonyms:
ACM3_HUMAN Cholinergic, muscarinic M3 Muscarinic receptor M3 | RecName: Full=Muscarinic acetylcholine receptor M3
Type:
Enzyme
Mol. Mass.:
66151.03
Organism:
Homo sapiens (Human)
Description:
P20309
Residue:
590
  
Inhibitor
Name:
BDBM50345681
Synonyms:
(3-endo)-1,1-Bis-(3-fluorophenyl)-2-(8,8-dimethyl-8-azoniabicyclo[3.2.1]oct-3-yl)ethanol Iodide | CHEMBL1782095
Type:
Small organic molecule
Emp. Form.:
C23H28F2NO
Mol. Mass.:
372.4708
SMILES:
C[N+]1(C)[C@@H]2CC[C@@H]1CC(CC(O)(c1cccc(F)c1)c1cccc(F)c1)C2
: